Target
Mitogen-activated protein kinase 10
Ligand
BDBM50169961
Substrate
Meas. Tech.
ChEMBL_304976 (CHEMBL829309)
IC50
1490±n/a nM
Citation
 Gaillard, PJeanclaude-Etter, IArdissone, VArkinstall, SCambet, YCamps, MChabert, CChurch, DCirillo, RGretener, DHalazy, SNichols, ASzyndralewiez, CVitte, PAGotteland, JP Design and synthesis of the first generation of novel potent, selective, and in vivo active (benzothiazol-2-yl)acetonitrile inhibitors of the c-Jun N-terminal kinase. J Med Chem 48:4596-607 (2005)  
Target
Name:
Mitogen-activated protein kinase 10
Synonyms:
Jnk3 Mapk10 c-Jun N-terminal kinase 3
Type:
PROTEIN
Mol. Mass.:
52534.34
Organism:
Rattus norvegicus
Description:
ChEMBL_1460661
Residue:
464
  
Inhibitor
Name:
BDBM50169961
Synonyms:
CHEMBL363556 | [2-(2-Amino-ethylamino)-pyrimidin-4-yl]-[3H-benzothiazol-(2Z)-ylidene]-acetonitrile
Type:
Small organic molecule
Emp. Form.:
C15H14N6S
Mol. Mass.:
310.377
SMILES:
NCCNc1nccc(n1)C(C#N)c1nc2ccccc2s1
: