Target
S-methyl-5'-thioadenosine phosphorylase
Ligand
BDBM50170093
Substrate
Meas. Tech.
ChEMBL_302838 (CHEMBL827883)
Ki
26±n/a nM
Citation
 Evans, GBFurneaux, RHLenz, DHPainter, GFSchramm, VLSingh, VTyler, PC Second generation transition state analogue inhibitors of human 5'-methylthioadenosine phosphorylase. J Med Chem 48:4679-89 (2005)  
Target
Name:
S-methyl-5'-thioadenosine phosphorylase
Synonyms:
5'-Methylthioadenosine phosphorylase (MTAP) MTA phosphorylase MTAP_HUMAN Methylthioadenosine Phosphorylase (MTAP) | S-methyl-5 -thioadenosine phosphorylase
Type:
Enzyme
Mol. Mass.:
31239.23
Organism:
Homo sapiens (Human)
Description:
Residue:
283
  
Inhibitor
Name:
BDBM50170093
Synonyms:
2-(4-Amino-5H-pyrrolo[3,2-d]pyrimidin-7-yl)-3,4-dihydroxy-5-methylsulfanylmethyl-pyrrolidinium | ImmA-Me
Type:
Small organic molecule
Emp. Form.:
C12H18N5O2S
Mol. Mass.:
296.368
SMILES:
CSCC1[NH2+]C(C(O)C1O)c1c[nH]c2c(N)ncnc12
: