Target
Neuronal acetylcholine receptor; alpha2/beta4
Ligand
BDBM50170594
Substrate
Meas. Tech.
ChEMBL_305725 (CHEMBL829397)
IC50
2300±n/a nM
Citation
 Jensen, AAFrølund, BLiljefors, TKrogsgaard-Larsen, P Neuronal nicotinic acetylcholine receptors: structural revelations, target identifications, and therapeutic inspirations. J Med Chem 48:4705-45 (2005)  
Target
Name:
Neuronal acetylcholine receptor; alpha2/beta4
Synonyms:
Neuronal acetylcholine receptor protein alpha-2 subunit/subunit beta-4 | Neuronal acetylcholine receptor subunit alpha-2/beta-4
Type:
Mol. Mass.:
Description:
ASSAY_ID of ChEMBL is 2150172
Components:
This complex has 2 components.
Component 1
Name:
Neuronal acetylcholine receptor subunit beta-4
Synonyms:
ACHB4_HUMAN Cholinergic, Nicotinic Alpha6Beta3Beta4Alpha5 Nicotinic acetylcholine receptor alpha6/alpha3/beta4
Type:
Enzyme Catalytic Domain
Mol. Mass.:
56388.51
Organism:
Homo sapiens (Human)
Description:
Cholinergic, Nicotinic Alpha6Beta3Beta4Alpha5 0 HUMAN::P30926
Residue:
498
  
Component 2
Name:
Neuronal acetylcholine receptor subunit alpha-2
Synonyms:
ACHA2_HUMAN Neuronal acetylcholine receptor; alpha2/beta2
Type:
Enzyme Catalytic Domain
Mol. Mass.:
59759.69
Organism:
Homo sapiens (Human)
Description:
Cholinergic, Nicotinic Alpha2Beta2 0 HUMAN::Q15822
Residue:
529
  
Inhibitor
Name:
BDBM50170594
Synonyms:
(16R)-9,33-dihydroxy-10,25-dimethoxy-15,15,30-trimethyl-7,23-dioxa-15,30-diazaheptacyclo[22.6.2.2^{3,6}.1^{8,12}.1^{18,22}.0^{27,31}.0^{16,34}]hexatriaconta-3,5,8(34),9,11,18(33),19,21,24(32),25,27(31),35-dodecaen-15-ium | CHEMBL405936
Type:
Small organic molecule
Emp. Form.:
C37H41N2O6
Mol. Mass.:
609.7307
SMILES:
COc1cc2CC[N+](C)(C)[C@@H]3Cc4cccc(Oc5cc6C(Cc7ccc(Oc(c1O)c23)cc7)N(C)CCc6cc5OC)c4O
: