Target
3-beta-hydroxysteroid-Delta(8),Delta(7)-isomerase
Ligand
BDBM50170639
Substrate
Meas. Tech.
ChEMBL_303691 (CHEMBL829736)
Ki
450±n/a nM
Citation
 Laggner, CSchieferer, CFiechtner, BPoles, GHoffmann, RDGlossmann, HLanger, TMoebius, FF Discovery of high-affinity ligands of sigma1 receptor, ERG2, and emopamil binding protein by pharmacophore modeling and virtual screening. J Med Chem 48:4754-64 (2005)  
Target
Name:
3-beta-hydroxysteroid-Delta(8),Delta(7)-isomerase
Synonyms:
3-beta-hydroxysteroid-Delta(8),Delta(7)-isomerase/Delta(24)-sterol reductase Anti-estrogen binding site (AEBS) D8-D7 sterol isomerase EBP Emopamil-binding protein
Type:
PROTEIN
Mol. Mass.:
26358.51
Organism:
Homo sapiens (Human)
Description:
ChEMBL_873432
Residue:
230
  
Inhibitor
Name:
BDBM50170639
Synonyms:
Benzothiazol-2-yl-methyl-[1-(4-phenoxy-butyl)-pyrrolidin-3-yl]-amine | CHEMBL363765
Type:
Small organic molecule
Emp. Form.:
C22H27N3OS
Mol. Mass.:
381.534
SMILES:
CN(C1CCN(CCCCOc2ccccc2)C1)c1nc2ccccc2s1
: