Target
Kappa-type opioid receptor
Ligand
BDBM50026687
Substrate
Meas. Tech.
ChEMBL_303225 (CHEMBL827190)
Ki
592±n/a nM
Citation
 Spetea, MGreiner, EAceto, MDHarris, LSCoop, ASchmidhammer, H Effect of a 6-cyano substituent in 14-oxygenated N-methylmorphinans on opioid receptor binding and antinociceptive potency. J Med Chem 48:5052-5 (2005)  
Target
Name:
Kappa-type opioid receptor
Synonyms:
KOR-1 OPIATE Kappa Opioid receptor Ror-d
Type:
G Protein-Coupled Receptor (GPCR)
Mol. Mass.:
42692.90
Organism:
Rattus norvegicus (rat)
Description:
P34975
Residue:
380
  
Inhibitor
Name:
BDBM50026687
Synonyms:
3-hydroxy-4,10-dimethoxy-17-methyl-(10S)-17-azatetracyclo[7.5.3.01,10.02,7]heptadeca-2(7),3,5-trien-13-one | 3-hydroxy-4,10-dimethoxy-17-methyl-17-azatetracyclo[7.5.3.01,10.02,7]heptadeca-2(7),3,5-trien-13-one
Type:
Small organic molecule
Emp. Form.:
C19H25NO4
Mol. Mass.:
331.4061
SMILES:
COc1ccc2CC3N(C)CC[C@@]4(CC(=O)CC[C@@]34OC)c2c1O
: