Target
Cannabinoid receptor 1
Ligand
BDBM23028
Substrate
Meas. Tech.
ChEMBL_302977 (CHEMBL827956)
Ki
1140±n/a nM
Citation
 Lambert, DMFowler, CJ The endocannabinoid system: drug targets, lead compounds, and potential therapeutic applications. J Med Chem 48:5059-87 (2005)  
Target
Name:
Cannabinoid receptor 1
Synonyms:
Brain-type cannabinoid receptor CB-R CNR1_RAT Cannabinoid receptor Cnr1 | Skr6
Type:
G Protein-Coupled Receptor (GPCR)
Mol. Mass.:
52856.55
Organism:
Rattus norvegicus (rat)
Description:
P20272
Residue:
473
  
Inhibitor
Name:
BDBM23028
Synonyms:
(9Z)-octadec-9-enamide CHEMBL15927 Oleic acid amide | Oleylamide
Type:
Emp. Form.:
C18H35NO
Mol. Mass.:
281.4766
SMILES:
CCCCCCCC\C=C/CCCCCCCC(N)=O
: