Target
Fatty-acid amide hydrolase 1
Ligand
BDBM23028
Substrate
Meas. Tech.
ChEMBL_306038 (CHEMBL832995)
IC50
68000±n/a nM
Citation
 Lambert, DMFowler, CJ The endocannabinoid system: drug targets, lead compounds, and potential therapeutic applications. J Med Chem 48:5059-87 (2005)  
Target
Name:
Fatty-acid amide hydrolase 1
Synonyms:
Anandamide amidohydrolase FAAH FAAH1_HUMAN Fatty-acid amide hydrolase (FAAH) Oleamide hydrolase 1
Type:
Protein
Mol. Mass.:
63071.19
Organism:
Homo sapiens (Human)
Description:
O00519
Residue:
579
  
Inhibitor
Name:
BDBM23028
Synonyms:
(9Z)-octadec-9-enamide CHEMBL15927 Oleic acid amide | Oleylamide
Type:
Emp. Form.:
C18H35NO
Mol. Mass.:
281.4766
SMILES:
CCCCCCCC\C=C/CCCCCCCC(N)=O
: