Target
Adenosine deaminase
Ligand
BDBM50171393
Substrate
Meas. Tech.
ChEMBL_302877 (CHEMBL828791)
Ki
8.050±n/a nM
Citation
 Da Settimo, FPrimofiore, GLa Motta, CTaliani, SSimorini, FMarini, AMMugnaini, LLavecchia, ANovellino, ETuscano, DMartini, C Novel, highly potent adenosine deaminase inhibitors containing the pyrazolo[3,4-d]pyrimidine ring system. Synthesis, structure-activity relationships, and molecular modeling studies. J Med Chem 48:5162-74 (2005)  
Target
Name:
Adenosine deaminase
Synonyms:
ADA Adenosine aminohydrolase
Type:
Enzyme
Mol. Mass.:
40910.44
Organism:
Bos taurus (bovine)
Description:
Residue:
363
  
Inhibitor
Name:
BDBM50171393
Synonyms:
2-Nonyl-2H-pyrazolo[3,4-d]pyrimidin-4-ylamine | CHEMBL189168
Type:
Small organic molecule
Emp. Form.:
C14H23N5
Mol. Mass.:
261.3659
SMILES:
CCCCCCCCCn1cc2c(N)ncnc2n1
: