Target
Cytochrome P450 2A5
Ligand
BDBM50159256
Substrate
Meas. Tech.
ChEMBL_305268 (CHEMBL832818)
IC50
100000±n/a nM
Citation
 Rahnasto, MRaunio, HPoso, AWittekindt, CJuvonen, RO Quantitative structure-activity relationship analysis of inhibitors of the nicotine metabolizing CYP2A6 enzyme. J Med Chem 48:440-9 (2005)  
Target
Name:
Cytochrome P450 2A5
Synonyms:
CP2A5_MOUSE Cyp2a5
Type:
PROTEIN
Mol. Mass.:
56752.73
Organism:
Mus musculus
Description:
ChEMBL_572014
Residue:
494
  
Inhibitor
Name:
BDBM50159256
Synonyms:
3-Methyl-1-benzazine CHEMBL195661
Type:
Small organic molecule
Emp. Form.:
C10H9N
Mol. Mass.:
143.1852
SMILES:
Cc1cnc2ccccc2c1
: