Target
Neprilysin
Ligand
BDBM50159367
Substrate
Meas. Tech.
ChEMBL_305089 (CHEMBL832394)
IC50
>100000±n/a nM
Citation
 Berger, YDehmlow, HBlum-Kaelin, DKitas, EALöffler, BMAebi, JDJuillerat-Jeanneret, L Endothelin-converting enzyme-1 inhibition and growth of human glioblastoma cells. J Med Chem 48:483-98 (2005)  
Target
Name:
Neprilysin
Synonyms:
Atriopeptidase CD_antigen=CD10 EPN MME NEP_HUMAN Neutral endopeptidase | Neutral endopeptidase 24.11
Type:
Enzyme
Mol. Mass.:
85505.38
Organism:
Homo sapiens (Human)
Description:
P08473
Residue:
750
  
Inhibitor
Name:
BDBM50159367
Synonyms:
(2S,4R)-4-Benzoylsulfanyl-2-(2,4,5-trifluoro-benzyloxymethyl)-pyrrolidine-1-carboxylic acid 2,3-dihydro-benzo[1,4]dioxin-5-yl ester | CHEMBL193490
Type:
Small organic molecule
Emp. Form.:
C28H24F3NO6S
Mol. Mass.:
559.553
SMILES:
Fc1cc(F)c(COC[C@@H]2C[C@H](CN2C(=O)Oc2cccc3OCCOc23)SC(=O)c2ccccc2)cc1F
: