Target
Neprilysin
Ligand
BDBM50159363
Substrate
Meas. Tech.
ChEMBL_305089 (CHEMBL832394)
IC50
81900±n/a nM
Citation
 Berger, YDehmlow, HBlum-Kaelin, DKitas, EALöffler, BMAebi, JDJuillerat-Jeanneret, L Endothelin-converting enzyme-1 inhibition and growth of human glioblastoma cells. J Med Chem 48:483-98 (2005)  
Target
Name:
Neprilysin
Synonyms:
Atriopeptidase CD_antigen=CD10 EPN MME NEP_HUMAN Neutral endopeptidase | Neutral endopeptidase 24.11
Type:
Enzyme
Mol. Mass.:
85505.38
Organism:
Homo sapiens (Human)
Description:
P08473
Residue:
750
  
Inhibitor
Name:
BDBM50159363
Synonyms:
CHEMBL177000 | methyl 2-(2-{N-methyl-1-[(4R)-1-(naphthalene-2-sulfonyl)-4-sulfanylpyrrolidin-2-yl]formamido}acetamido)benzoate
Type:
Small organic molecule
Emp. Form.:
C26H27N3O6S2
Mol. Mass.:
541.639
SMILES:
COC(=O)c1ccccc1NC(=O)CN(C)C(=O)C1C[C@@H](S)CN1S(=O)(=O)c1ccc2ccccc2c1
: