Target
Neprilysin
Ligand
BDBM50159368
Substrate
Meas. Tech.
ChEMBL_305037 (CHEMBL877471)
IC50
39200±n/a nM
Citation
 Berger, YDehmlow, HBlum-Kaelin, DKitas, EALöffler, BMAebi, JDJuillerat-Jeanneret, L Endothelin-converting enzyme-1 inhibition and growth of human glioblastoma cells. J Med Chem 48:483-98 (2005)  
Target
Name:
Neprilysin
Synonyms:
Atriopeptidase CD_antigen=CD10 EPN MME NEP_HUMAN Neutral endopeptidase | Neutral endopeptidase 24.11
Type:
Enzyme
Mol. Mass.:
85505.38
Organism:
Homo sapiens (Human)
Description:
P08473
Residue:
750
  
Inhibitor
Name:
BDBM50159368
Synonyms:
(4R)-N'-methyl-N'-[(4-methylbenzene)sulfonyl]-1-(naphthalene-2-sulfonyl)-4-sulfanylpyrrolidine-2-carbohydrazide | CHEMBL425383
Type:
Small organic molecule
Emp. Form.:
C23H25N3O5S3
Mol. Mass.:
519.657
SMILES:
CN(NC(=O)C1C[C@@H](S)CN1S(=O)(=O)c1ccc2ccccc2c1)S(=O)(=O)c1ccc(C)cc1
: