Target
Membrane primary amine oxidase
Ligand
BDBM50161136
Substrate
Meas. Tech.
ChEMBL_306569 (CHEMBL832086)
IC50
3200±n/a nM
Citation
 Bertini, VBuffoni, FIgnesti, GPicci, NTrombino, SIemma, FAlfei, SPocci, MLucchesini, FDe Munno, A Alkylamino derivatives of 4-aminomethylpyridine as inhibitors of copper-containing amine oxidases. J Med Chem 48:664-70 (2005)  
Target
Name:
Membrane primary amine oxidase
Synonyms:
AOC3 Amine oxidase, copper containing Semicarbazide-sensitive amine oxidase/ Vascular adhesion protein 1 (SSAO/VAP-1) Vascular adhesion protein 1 (VAP-1)
Type:
Protein
Mol. Mass.:
84620.86
Organism:
Homo sapiens (Human)
Description:
Q16853
Residue:
763
  
Inhibitor
Name:
BDBM50161136
Synonyms:
2-{[4-(aminomethyl)-5-(2-hydroxyethoxy)pyridin-3-yl]oxy}ethanol dihydrochloride trihydrate | CHEMBL536719
Type:
Small organic molecule
Emp. Form.:
C10H16N2O4
Mol. Mass.:
228.245
SMILES:
NCc1c(OCCO)cncc1OCCO
: