Target
Cannabinoid receptor 1
Ligand
BDBM50163122
Substrate
Meas. Tech.
ChEMBL_303193 (CHEMBL829819)
Ki
30±n/a nM
Citation
 Lange, JHvan Stuivenberg, HHCoolen, HKAdolfs, TJMcCreary, ACKeizer, HGWals, HCVeerman, WBorst, AJde Looff, WVerveer, PCKruse, CG Bioisosteric replacements of the pyrazole moiety of rimonabant: synthesis, biological properties, and molecular modeling investigations of thiazoles, triazoles, and imidazoles as potent and selective CB1 cannabinoid receptor antagonists. J Med Chem 48:1823-38 (2005)  
Target
Name:
Cannabinoid receptor 1
Synonyms:
CANN6 CB-R CNR CNR1_HUMAN Cannabinoid receptor Cannabinoid receptor 1 (brain)
Type:
G Protein-Coupled Receptor (GPCR)
Mol. Mass.:
52868.96
Organism:
Homo sapiens (Human)
Description:
P21554
Residue:
472
  
Inhibitor
Name:
BDBM50163122
Synonyms:
1-(4-Chloro-phenyl)-5-cyano-2-(2,4-dichloro-phenyl)-1H-imidazole-4-carboxylic acid piperidin-1-ylamide CHEMBL369072
Type:
Small organic molecule
Emp. Form.:
C22H18Cl3N5O
Mol. Mass.:
474.77
SMILES:
Clc1ccc(cc1)-n1c(nc(C(=O)NN2CCCCC2)c1C#N)-c1ccc(Cl)cc1Cl
: