Target
Cannabinoid receptor 1
Ligand
BDBM50163125
Substrate
Meas. Tech.
ChEMBL_303193 (CHEMBL829819)
Ki
356±n/a nM
Citation
 Lange, JHvan Stuivenberg, HHCoolen, HKAdolfs, TJMcCreary, ACKeizer, HGWals, HCVeerman, WBorst, AJde Looff, WVerveer, PCKruse, CG Bioisosteric replacements of the pyrazole moiety of rimonabant: synthesis, biological properties, and molecular modeling investigations of thiazoles, triazoles, and imidazoles as potent and selective CB1 cannabinoid receptor antagonists. J Med Chem 48:1823-38 (2005)  
Target
Name:
Cannabinoid receptor 1
Synonyms:
CANN6 CB-R CNR CNR1_HUMAN Cannabinoid receptor Cannabinoid receptor 1 (brain)
Type:
G Protein-Coupled Receptor (GPCR)
Mol. Mass.:
52868.96
Organism:
Homo sapiens (Human)
Description:
P21554
Residue:
472
  
Inhibitor
Name:
BDBM50163125
Synonyms:
1-(4-Chloro-phenyl)-5-(2,4-dichloro-phenyl)-1H-[1,2,4]triazole-3-carboxylic acid piperidin-1-ylamide; dihydrochloride | CHEMBL558785
Type:
Small organic molecule
Emp. Form.:
C20H18Cl3N5O
Mol. Mass.:
450.749
SMILES:
Clc1ccc(cc1)-n1nc(nc1-c1ccc(Cl)cc1Cl)C(=O)NN1CCCCC1
: