Target
Melanocyte-stimulating hormone receptor
Ligand
BDBM50163141
Substrate
Meas. Tech.
ChEMBL_306266 (CHEMBL828399)
IC50
0.700000±n/a nM
Citation
 Cai, MMayorov, AVCabello, CStankova, MTrivedi, DHruby, VJ Novel 3D pharmacophore of alpha-MSH/gamma-MSH hybrids leads to selective human MC1R and MC3R analogues. J Med Chem 48:1839-48 (2005)  
Target
Name:
Melanocyte-stimulating hormone receptor
Synonyms:
MC1-R MSH-R MSHR_HUMAN Melanocortin receptor (M1 and M4) Melanocortin receptor 1 (MC1-R) | Melanocortin receptor 1 (MC1R)
Type:
Enzyme
Mol. Mass.:
34717.23
Organism:
Homo sapiens (Human)
Description:
Q01726
Residue:
317
  
Inhibitor
Name:
BDBM50163141
Synonyms:
CHEMBL438920 | H-Tyr-Val-Nle-Gly-His-D-Phe-Arg-D-Nal(2'')-Asp-Arg-Phe-Gly-NH2
Type:
Small organic molecule
Emp. Form.:
C77H103N21O16
Mol. Mass.:
1578.7728
SMILES:
CCCC[C@H](NC(=O)[C@@H](NC(=O)[C@@H](N)Cc1ccc(O)cc1)C(C)C)C(=O)NCC(=O)N[C@@H](Cc1cnc[nH]1)C(=O)N[C@@H](Cc1ccccc1)C(=O)N[C@@H](CCCNC(N)=N)C(=O)N[C@H](Cc1ccc2ccccc2c1)C(=O)N[C@@H](CC(O)=O)C(=O)N[C@@H](CCCNC(N)=N)C(=O)N[C@@H](Cc1ccccc1)C(=O)NCC(=O)ON
: