Target
Adenosine receptor A2a
Ligand
BDBM50163403
Substrate
Meas. Tech.
ChEMBL_303283 (CHEMBL828276)
Ki
11±n/a nM
Citation
 Vu, CBPan, DPeng, BKumaravel, GSmits, GJin, XPhadke, DEngber, THuang, CReilly, JTam, SGrant, DHetu, GPetter, RC Novel diamino derivatives of [1,2,4]triazolo[1,5-a][1,3,5]triazine as potent and selective adenosine A2a receptor antagonists. J Med Chem 48:2009-18 (2005)  
Target
Name:
Adenosine receptor A2a
Synonyms:
AA2AR_RAT Adenosine A2 receptor Adenosine Receptors A2a (A2a) Adenosine receptors A2a Rat striatal adenosine A2a receptor
Type:
G Protein-Coupled Receptor (GPCR)
Mol. Mass.:
45015.65
Organism:
Rattus norvegicus (rat)
Description:
Rat A2A receptors expressed in CHO cells.
Residue:
410
  
Inhibitor
Name:
BDBM50163403
Synonyms:
CHEMBL368070 | N*5*-[(R)-1-(2,4-Dichloro-benzyl)-pyrrolidin-2-ylmethyl]-2-furan-2-yl-[1,2,4]triazolo[1,5-a][1,3,5]triazine-5,7-diamine
Type:
Small organic molecule
Emp. Form.:
C20H20Cl2N8O
Mol. Mass.:
459.332
SMILES:
Nc1nc(NC[C@H]2CCCN2Cc2ccc(Cl)cc2Cl)nc2nc(nn12)-c1ccco1
: