Target
Progesterone receptor
Ligand
BDBM50422735
Substrate
Meas. Tech.
ChEMBL_302163 (CHEMBL829231)
Kd
2.5±n/a nM
Citation
 Gilli, PGilli, GBorea, PAVarani, KScatturin, ADalpiaz, A Binding thermodynamics as a tool to investigate the mechanisms of drug-receptor interactions: thermodynamics of cytoplasmic steroid/nuclear receptors in comparison with membrane receptors. J Med Chem 48:2026-35 (2005)  
Target
Name:
Progesterone receptor
Synonyms:
NR3C3 PGR PRGR_HUMAN | progesterone
Type:
Protein
Mol. Mass.:
98979.52
Organism:
Homo sapiens (Human)
Description:
P06401
Residue:
933
  
Inhibitor
Name:
BDBM50422735
Synonyms:
CHEMBL2311103 | ORG-2058
Type:
Small organic molecule
Emp. Form.:
C22H32O3
Mol. Mass.:
344.4877
SMILES:
CC[C@@H]1C[C@H]2[C@@H]3CCC4=CC(=O)CC[C@@H]4[C@H]3CC[C@]2(C)[C@H]1C(=O)CO
: