Target
Neuropeptide Y receptor type 5
Ligand
BDBM50163516
Substrate
Meas. Tech.
ChEMBL_305314 (CHEMBL831705)
IC50
7.7±n/a nM
Citation
 Torrens, AMas, JPort, ACastrillo, JASanfeliu, OGuitart, XDordal, ARomero, GFisas, MASánchez, EHernández, EPérez, PPérez, RBuschmann, H Synthesis of new benzoxazinone derivatives as neuropeptide Y5 antagonists for the treatment of obesity. J Med Chem 48:2080-92 (2005)  
Target
Name:
Neuropeptide Y receptor type 5
Synonyms:
NPY-Y5 Neuropeptide Y receptor type 5 Npyr5
Type:
Enzyme Catalytic Domain
Mol. Mass.:
50435.58
Organism:
Rat 6B
Description:
NPY-Y5 NPY5R Rat 6B::Q63634
Residue:
445
  
Inhibitor
Name:
BDBM50163516
Synonyms:
2-[4-(6-Fluoro-2-oxo-4H-benzo[d][1,3]oxazin-1-yl)-piperidin-1-yl]-N-quinolin-6-yl-acetamide | CHEMBL179154
Type:
Small organic molecule
Emp. Form.:
C24H23FN4O3
Mol. Mass.:
434.4628
SMILES:
Fc1ccc2N(C3CCN(CC(=O)Nc4ccc5ncccc5c4)CC3)C(=O)OCc2c1
: