Target
Neuropeptide Y receptor type 5
Ligand
BDBM50163522
Substrate
Meas. Tech.
ChEMBL_305314 (CHEMBL831705)
IC50
112.4±n/a nM
Citation
 Torrens, AMas, JPort, ACastrillo, JASanfeliu, OGuitart, XDordal, ARomero, GFisas, MASánchez, EHernández, EPérez, PPérez, RBuschmann, H Synthesis of new benzoxazinone derivatives as neuropeptide Y5 antagonists for the treatment of obesity. J Med Chem 48:2080-92 (2005)  
Target
Name:
Neuropeptide Y receptor type 5
Synonyms:
NPY-Y5 Neuropeptide Y receptor type 5 Npyr5
Type:
Enzyme Catalytic Domain
Mol. Mass.:
50435.58
Organism:
Rat 6B
Description:
NPY-Y5 NPY5R Rat 6B::Q63634
Residue:
445
  
Inhibitor
Name:
BDBM50163522
Synonyms:
2-[4-(6-Chloro-2-oxo-4H-benzo[d][1,3]oxazin-1-yl)-piperidin-1-yl]-N-(4-cyclohexyl-phenyl)-acetamide | CHEMBL536045
Type:
Small organic molecule
Emp. Form.:
C27H32ClN3O3
Mol. Mass.:
482.014
SMILES:
Clc1ccc2N(C3CCN(CC(=O)Nc4ccc(cc4)C4CCCCC4)CC3)C(=O)OCc2c1
: