Target
Neuropeptide Y receptor type 5
Ligand
BDBM50163531
Substrate
Meas. Tech.
ChEMBL_305314 (CHEMBL831705)
IC50
54.6±n/a nM
Citation
 Torrens, AMas, JPort, ACastrillo, JASanfeliu, OGuitart, XDordal, ARomero, GFisas, MASánchez, EHernández, EPérez, PPérez, RBuschmann, H Synthesis of new benzoxazinone derivatives as neuropeptide Y5 antagonists for the treatment of obesity. J Med Chem 48:2080-92 (2005)  
Target
Name:
Neuropeptide Y receptor type 5
Synonyms:
NPY-Y5 Neuropeptide Y receptor type 5 Npyr5
Type:
Enzyme Catalytic Domain
Mol. Mass.:
50435.58
Organism:
Rat 6B
Description:
NPY-Y5 NPY5R Rat 6B::Q63634
Residue:
445
  
Inhibitor
Name:
BDBM50163531
Synonyms:
CHEMBL557817 | N-(9-Ethyl-9H-carbazol-3-yl)-2-[4-(2-oxo-4H-benzo[d][1,3]oxazin-1-yl)-piperidin-1-yl]-acetamide
Type:
Small organic molecule
Emp. Form.:
C29H29ClN4O3
Mol. Mass.:
517.019
SMILES:
CCn1c2ccccc2c2cc(NC(=O)CN3CCC(CC3)N3C(=O)OCc4c(Cl)cccc34)ccc12
: