Target
Metabotropic glutamate receptor 1
Ligand
BDBM50163601
Substrate
Meas. Tech.
ChEMBL_305883 (CHEMBL874546)
IC50
7±n/a nM
Citation
 Mabire, DCoupa, SAdelinet, CPoncelet, ASimonnet, YVenet, MWouters, RLesage, ASVan Beijsterveldt, LBischoff, F Synthesis, structure-activity relationship, and receptor pharmacology of a new series of quinoline derivatives acting as selective, noncompetitive mGlu1 antagonists. J Med Chem 48:2134-53 (2005)  
Target
Name:
Metabotropic glutamate receptor 1
Synonyms:
GPRC1A GRM1_HUMAN Metabotropic Glutamate 1a | metabotropic glutamate 1
Type:
Enzyme
Mol. Mass.:
132358.19
Organism:
Homo sapiens (Human)
Description:
Q13255
Residue:
1194
  
Inhibitor
Name:
BDBM50163601
Synonyms:
(2,3-Dihydro-benzo[1,4]dioxin-2-yl)-(3-ethyl-2-methyl-quinolin-6-yl)-methanone | CHEMBL177519
Type:
Small organic molecule
Emp. Form.:
C21H19NO3
Mol. Mass.:
333.3805
SMILES:
CCc1cc2cc(ccc2nc1C)C(=O)C1COc2ccccc2O1
: