Target
Metabotropic glutamate receptor 1
Ligand
BDBM50163613
Substrate
Meas. Tech.
ChEMBL_305883 (CHEMBL874546)
IC50
0.56±n/a nM
Citation
 Mabire, DCoupa, SAdelinet, CPoncelet, ASimonnet, YVenet, MWouters, RLesage, ASVan Beijsterveldt, LBischoff, F Synthesis, structure-activity relationship, and receptor pharmacology of a new series of quinoline derivatives acting as selective, noncompetitive mGlu1 antagonists. J Med Chem 48:2134-53 (2005)  
Target
Name:
Metabotropic glutamate receptor 1
Synonyms:
GPRC1A GRM1_HUMAN Metabotropic Glutamate 1a | metabotropic glutamate 1
Type:
Enzyme
Mol. Mass.:
132358.19
Organism:
Homo sapiens (Human)
Description:
Q13255
Residue:
1194
  
Inhibitor
Name:
BDBM50163613
Synonyms:
(2,3-Dihydro-1H-cyclopenta[b]quinolin-7-yl)-(4-methoxy-cyclohexyl)-methanone | CHEMBL178690
Type:
Small organic molecule
Emp. Form.:
C20H23NO2
Mol. Mass.:
309.4021
SMILES:
CO[C@H]1CC[C@H](CC1)C(=O)c1ccc2nc3CCCc3cc2c1
: