Target
Melanocyte-stimulating hormone receptor
Ligand
BDBM50410397
Substrate
Meas. Tech.
ChEMBL_304133 (CHEMBL840250)
EC50
0.2±n/a nM
Citation
 Wilczynski, AWilson, KRScott, JWEdison, ASHaskell-Luevano, C Structure-activity relationships of the unique and potent agouti-related protein (AGRP)-melanocortin chimeric Tyr-c[beta-Asp-His-DPhe-Arg-Trp-Asn-Ala-Phe-Dpr]-Tyr-NH2 peptide template. J Med Chem 48:3060-75 (2005)  
Target
Name:
Melanocyte-stimulating hormone receptor
Synonyms:
MC1-R Mc1r Melanocyte-stimulating hormone receptor | Msh-r
Type:
PROTEIN
Mol. Mass.:
35238.60
Organism:
Mus musculus
Description:
ChEMBL_1498846
Residue:
315
  
Inhibitor
Name:
BDBM50410397
Synonyms:
CHEMBL2096718
Type:
Small organic molecule
Emp. Form.:
C75H88N18O16
Mol. Mass.:
1497.6122
SMILES:
C[C@@H]1NC(=O)[C@H](CC(N)=O)NC(=O)[C@@H](Cc2ccc3ccccc3c2)NC(=O)[C@H](CCCNC(N)=N)NC(=O)[C@@H](Cc2ccccc2)NC(=O)[C@H](Cc2cnc[nH]2)NC(=O)[C@H](CC(=O)N([C@@H](Cc2ccc(O)cc2)C(N)=O)C(C)(NC(=O)[C@H](Cc2ccccc2)NC1=O)C(O)=O)NC(=O)[C@@H](N)Cc1ccc(O)cc1
: