Target
Neuronal acetylcholine receptor subunit alpha-7
Ligand
BDBM50366779
Substrate
Meas. Tech.
ChEMBL_321014 (CHEMBL871846)
Ki
7.3±n/a nM
Citation
 Baker, SRBoot, JBrunavs, MDobson, DGreen, RHayhurst, LKeenan, MWallace, L High affinity ligands for the alpha7 nicotinic receptor that show no cross-reactivity with the 5-HT3 receptor. Bioorg Med Chem Lett 15:4727-30 (2005)  
Target
Name:
Neuronal acetylcholine receptor subunit alpha-7
Synonyms:
ACHA7_HUMAN Cholinergic, Nicotinic Alpha7 Neuronal acetylcholine receptor protein alpha-7 subunit Nicotinic acetylcholine receptor alpha-7 (alpha7 nAChR)
Type:
Mol. Mass.:
56448.33
Organism:
Homo sapiens (Human)
Description:
CHRNA7 (NACHRA7)
Residue:
502
  
Inhibitor
Name:
BDBM50366779
Synonyms:
METHYLLYCACONITINE
Type:
Small organic molecule
Emp. Form.:
C37H50N2O10
Mol. Mass.:
682.8003
SMILES:
CCN1C[C@]2(COC(=O)c3ccccc3-n3c(O)cc(C)c3O)CC[C@H](OC)[C@@]34[C@@H]5C[C@H]6[C@H](OC)[C@@H]5[C@](O)(C[C@@H]6OC)[C@](O)([C@@H](OC)[C@H]23)[C@H]14
: