Target
Glycogen phosphorylase, muscle form
Ligand
BDBM50172978
Substrate
Meas. Tech.
ChEMBL_321381 (CHEMBL881759)
IC50
110±n/a nM
Citation
 Dudash, JZhang, YMoore, JBLook, RLiang, YBeavers, MPConway, BRRybczynski, PJDemarest, KT Synthesis and evaluation of 3-anilino-quinoxalinones as glycogen phosphorylase inhibitors. Bioorg Med Chem Lett 15:4790-3 (2005)  
Target
Name:
Glycogen phosphorylase, muscle form
Synonyms:
Glycogen phosphorylase, muscle form Myophosphorylase PYGM_HUMAN
Type:
PROTEIN
Mol. Mass.:
97097.45
Organism:
Homo sapiens (Human)
Description:
ChEMBL_1449751
Residue:
842
  
Inhibitor
Name:
BDBM50172978
Synonyms:
CHEMBL194177 | N-Isoxazol-3-yl-4-(4-methyl-3-oxo-3,4-dihydro-quinoxalin-2-ylamino)-benzamide
Type:
Small organic molecule
Emp. Form.:
C19H15N5O3
Mol. Mass.:
361.3541
SMILES:
Cn1c2ccccc2nc(Nc2ccc(cc2)C(=O)Nc2ccon2)c1=O
: