Target
Cannabinoid receptor 1
Ligand
BDBM50172901
Substrate
Meas. Tech.
ChEMBL_320879 (CHEMBL884804)
Ki
209±n/a nM
Citation
 Lange, JHvan Stuivenberg, HHVeerman, WWals, HCStork, BCoolen, HKMcCreary, ACAdolfs, TJKruse, CG Novel 3,4-diarylpyrazolines as potent cannabinoid CB1 receptor antagonists with lower lipophilicity. Bioorg Med Chem Lett 15:4794-8 (2005)  
Target
Name:
Cannabinoid receptor 1
Synonyms:
CANN6 CB-R CNR CNR1_HUMAN Cannabinoid receptor Cannabinoid receptor 1 (brain)
Type:
G Protein-Coupled Receptor (GPCR)
Mol. Mass.:
52868.96
Organism:
Homo sapiens (Human)
Description:
P21554
Residue:
472
  
Inhibitor
Name:
BDBM50172901
Synonyms:
3,4-diarylpyrazoline derivative | CHEMBL372697
Type:
Small organic molecule
Emp. Form.:
C22H28ClN5O2S
Mol. Mass.:
462.008
SMILES:
CCN=C(NS(=O)(=O)N(CC)CC)N1CC(C(=N1)c1ccc(Cl)cc1)c1ccccc1
: