Target
Neuronal acetylcholine receptor subunit alpha-4/beta-2
Ligand
BDBM50174164
Substrate
Meas. Tech.
ChEMBL_320951 (CHEMBL882470)
Ki
0.75±n/a nM
Citation
 Coe, JWBrooks, PRWirtz, MCBashore, CGBianco, KEVetelino, MGArnold, EPLebel, LAFox, CBTingley, FDSchulz, DWDavis, TISands, SBMansbach, RSRollema, HO'Neill, BT 3,5-Bicyclic aryl piperidines: a novel class of alpha4beta2 neuronal nicotinic receptor partial agonists for smoking cessation. Bioorg Med Chem Lett 15:4889-97 (2005)  
Target
Name:
Neuronal acetylcholine receptor subunit alpha-4/beta-2
Synonyms:
Neuronal acetylcholine receptor Alpha-4/Beta-2 Neuronal acetylcholine receptor; alpha4/beta2 | nAChR subtypes alpha4 beta2
Type:
Protein
Mol. Mass.:
Description:
Components:
This complex has 2 components.
Component 1
Name:
Neuronal acetylcholine receptor subunit alpha-4
Synonyms:
ACHA4_HUMAN CHRNA4 protein Neuronal acetylcholine receptor protein alpha-4 subunit Nicotinic acetylcholine receptor alpha4/beta2/alpha5
Type:
Mol. Mass.:
69963.49
Organism:
Homo sapiens (Human)
Description:
NACHRA4
Residue:
627
  
Component 2
Name:
Neuronal acetylcholine receptor subunit beta-2
Synonyms:
ACHB2_HUMAN Neuronal acetylcholine receptor protein beta-2 subunit | Nicotinic acetylcholine receptor alpha3/beta2/alpha5
Type:
Protein
Mol. Mass.:
57020.50
Organism:
Homo sapiens (Human)
Description:
P17787
Residue:
502
  
Inhibitor
Name:
BDBM50174164
Synonyms:
7-methyl-5,7,13-triazatetracyclo[9.3.1.02,10.04,8]pentadeca-2(10),3,5,8-tetraene | CHEMBL198032
Type:
Small organic molecule
Emp. Form.:
C13H15N3
Mol. Mass.:
213.2783
SMILES:
Cn1cnc2cc3C4CC(CNC4)c3cc12
: