Target
Mycothiol S-conjugate amidase
Ligand
BDBM50117090
Substrate
Meas. Tech.
ChEMBL_321414 (CHEMBL881945)
IC50
2800±n/a nM
Citation
 Nicolaou, KC Joys of molecules. 2. Endeavors in chemical biology and medicinal chemistry. J Med Chem 48:5613-38 (2005)  
Target
Name:
Mycothiol S-conjugate amidase
Synonyms:
MCA_MYCTU | mca
Type:
PROTEIN
Mol. Mass.:
32719.79
Organism:
Mycobacterium tuberculosis
Description:
ChEMBL_626858
Residue:
288
  
Inhibitor
Name:
BDBM50117090
Synonyms:
(E,E)-Psammaplin A 3-(3-Bromo-4-hydroxy-phenyl)-N-(2-{2-[3-(3-bromo-4-hydroxy-phenyl)-2-hydroxyimino-propionylamino]-ethyldisulfanyl}-ethyl)-2-hydroxyimino-propionamide 3-(3-bromo-4-hydroxy-phenyl)-N-[2-(2-{3-(3-bromo-4-hydroxy-phenyl)-2-[hydroxyimino]-propionylamino}-ethyldisulfanyl)-ethyl]-2-[hydroxyimino]-propionamide Psammaplin A
Type:
Small organic molecule
Emp. Form.:
C22H24Br2N4O6S2
Mol. Mass.:
664.387
SMILES:
Oc1ccc(CC(N=O)C(=O)NCCSSCCNC(=O)C(Cc2ccc(O)c(Br)c2)N=O)cc1Br
: