Target
DNA polymerase alpha catalytic subunit
Ligand
BDBM50090910
Substrate
Meas. Tech.
ChEMBL_321582 (CHEMBL884690)
pH
7.5±n/a
IC50
2600±n/a nM
Comments
extracted
Citation
 Schnute, MECudahy, MMBrideau, RJHoma, FLHopkins, TAKnechtel, MLOien, NLPitts, TWPoorman, RAWathen, MWWieber, JL 4-Oxo-4,7-dihydrothieno[2,3-b]pyridines as non-nucleoside inhibitors of human cytomegalovirus and related herpesvirus polymerases. J Med Chem 48:5794-804 (2005)  
Target
Name:
DNA polymerase alpha catalytic subunit
Synonyms:
DNA polymerase (alpha/delta/epsilon) DPOLA_HUMAN POLA1
Type:
PROTEIN
Mol. Mass.:
165895.25
Organism:
Homo sapiens (Human)
Description:
ChEMBL_1365493
Residue:
1462
  
Inhibitor
Name:
BDBM50090910
Synonyms:
3alpha,16,17,18-tetrahydroxyaphidicolone 6,13-di(hydroxymethyl)-2,6-dimethyl-(1S,2S,5R,6R,7R,10S,12R,13R)-tetracyclo[10.3.1.01,10.02,7]hexadecane-5,13-diol (Aphidicolin) CHEMBL29711 aphidicolin | cid_457964
Type:
Small organic molecule
Emp. Form.:
C20H34O4
Mol. Mass.:
338.4816
SMILES:
C[C@@]1(CO)[C@H](O)CC[C@@]2(C)[C@H]1CC[C@H]1C[C@@H]3C[C@]21CC[C@]3(O)CO
: