Target
Putative deoxyuridine triphosphatase
Ligand
BDBM50173532
Substrate
Meas. Tech.
ChEMBL_320883 (CHEMBL884808)
Ki
>1000000±n/a nM
Citation
 Nguyen, CKasinathan, GLeal-Cortijo, IMusso-Buendia, AKaiser, MBrun, RRuiz-Pérez, LMJohansson, NGGonzález-Pacanowska, DGilbert, IH Deoxyuridine triphosphate nucleotidohydrolase as a potential antiparasitic drug target. J Med Chem 48:5942-54 (2005)  
Target
Name:
Putative deoxyuridine triphosphatase
Synonyms:
dUTP pyrophosphatase | dUTPase
Type:
PROTEIN
Mol. Mass.:
30347.26
Organism:
Leishmania major
Description:
ChEMBL_320883
Residue:
268
  
Inhibitor
Name:
BDBM50173532
Synonyms:
1-[5-(tert-Butyl-diphenyl-silanyloxymethyl)-4-fluoro-tetrahydro-furan-2-yl]-1H-pyrimidine-2,4-dione dUTPase inhibitor, 7
Type:
Small organic molecule
Emp. Form.:
C25H29FN2O4Si
Mol. Mass.:
468.5927
SMILES:
CC(C)(C)[Si](OCC1OC(CC1F)n1ccc(=O)[nH]c1=O)(c1ccccc1)c1ccccc1
: