Target
Putative deoxyuridine triphosphatase
Ligand
BDBM50173568
Substrate
Meas. Tech.
ChEMBL_320883 (CHEMBL884808)
Ki
>1000000±n/a nM
Citation
 Nguyen, CKasinathan, GLeal-Cortijo, IMusso-Buendia, AKaiser, MBrun, RRuiz-Pérez, LMJohansson, NGGonzález-Pacanowska, DGilbert, IH Deoxyuridine triphosphate nucleotidohydrolase as a potential antiparasitic drug target. J Med Chem 48:5942-54 (2005)  
Target
Name:
Putative deoxyuridine triphosphatase
Synonyms:
dUTP pyrophosphatase | dUTPase
Type:
PROTEIN
Mol. Mass.:
30347.26
Organism:
Leishmania major
Description:
ChEMBL_320883
Residue:
268
  
Inhibitor
Name:
BDBM50173568
Synonyms:
CHEMBL3143774 | Sulfamic acid 3-(tert-butyl-dimethyl-silanyloxy)-5-(2,4-dioxo-3,4-dihydro-2H-pyrimidin-1-yl)-tetrahydro-furan-2-ylmethyl ester
Type:
Small organic molecule
Emp. Form.:
C15H27N3O7SSi
Mol. Mass.:
421.541
SMILES:
CC(C)(C)[Si](C)(C)O[C@H]1C[C@@H](O[C@@H]1COS(N)(=O)=O)n1ccc(=O)[nH]c1=O
: