Target
Deoxyuridine 5'-triphosphate nucleotidohydrolase
Ligand
BDBM50173571
Substrate
Meas. Tech.
ChEMBL_320965 (CHEMBL885372)
Ki
340000±n/a nM
Citation
 Nguyen, CKasinathan, GLeal-Cortijo, IMusso-Buendia, AKaiser, MBrun, RRuiz-Pérez, LMJohansson, NGGonzález-Pacanowska, DGilbert, IH Deoxyuridine triphosphate nucleotidohydrolase as a potential antiparasitic drug target. J Med Chem 48:5942-54 (2005)  
Target
Name:
Deoxyuridine 5'-triphosphate nucleotidohydrolase
Synonyms:
dUTP pyrophosphatase
Type:
Protein
Mol. Mass.:
19574.43
Organism:
Plasmodium falciparum
Description:
Q8II92
Residue:
173
  
Inhibitor
Name:
BDBM50173571
Synonyms:
CHEMBL3143771 | Phosphoric acid 3-(tert-butyl-dimethyl-silanyloxy)-5-(2,4-dioxo-3,4-dihydro-2H-pyrimidin-1-yl)-tetrahydro-furan-2-ylmethyl ester diethyl ester
Type:
Small organic molecule
Emp. Form.:
C19H35N2O8PSi
Mol. Mass.:
478.5491
SMILES:
CCOP(=O)(OCC)OC[C@H]1O[C@H](C[C@@H]1O[Si](C)(C)C(C)(C)C)n1ccc(=O)[nH]c1=O
: