Target
Putative deoxyuridine triphosphatase
Ligand
BDBM50173549
Substrate
Meas. Tech.
ChEMBL_320883 (CHEMBL884808)
Ki
>1000000±n/a nM
Citation
 Nguyen, CKasinathan, GLeal-Cortijo, IMusso-Buendia, AKaiser, MBrun, RRuiz-Pérez, LMJohansson, NGGonzález-Pacanowska, DGilbert, IH Deoxyuridine triphosphate nucleotidohydrolase as a potential antiparasitic drug target. J Med Chem 48:5942-54 (2005)  
Target
Name:
Putative deoxyuridine triphosphatase
Synonyms:
dUTP pyrophosphatase | dUTPase
Type:
PROTEIN
Mol. Mass.:
30347.26
Organism:
Leishmania major
Description:
ChEMBL_320883
Residue:
268
  
Inhibitor
Name:
BDBM50173549
Synonyms:
CHEMBL3143776 | Phosphoric acid 5-(2,4-dioxo-3,4-dihydro-2H-pyrimidin-1-yl)-3-hydroxy-tetrahydro-furan-2-ylmethyl ester diethyl ester
Type:
Small organic molecule
Emp. Form.:
C13H21N2O8P
Mol. Mass.:
364.2882
SMILES:
CCOP(=O)(OCC)OC[C@H]1O[C@H](C[C@@H]1O)n1ccc(=O)[nH]c1=O
: