Target
Sodium-dependent dopamine transporter
Ligand
BDBM30130
Substrate
Meas. Tech.
ChEMBL_320794 (CHEMBL884749)
Ki
1900±n/a nM
Citation
 Mattson, RJCatt, JDDenhart, DJDeskus, JADitta, JLHiggins, MAMarcin, LRSloan, CPBeno, BRGao, QCunningham, MAMattson, GKMolski, TFTaber, MTLodge, NJ Conformationally restricted homotryptamines. 2. Indole cyclopropylmethylamines as selective serotonin reuptake inhibitors. J Med Chem 48:6023-34 (2005)  
Target
Name:
Sodium-dependent dopamine transporter
Synonyms:
DA transporter DAT1 Dopamine transporter protein (DAT) SC6A3_HUMAN Sodium-dependent dopamine transporter Solute carrier family 6 member 3
Type:
Multi-pass membrane protein
Mol. Mass.:
68497.11
Organism:
Homo sapiens (Human)
Description:
Q01959
Residue:
620
  
Inhibitor
Name:
BDBM30130
Synonyms:
CHEMBL1201082 Fluoxetin Prozac cid_62857
Type:
Small organic molecule
Emp. Form.:
C17H18F3NO
Mol. Mass.:
309.3261
SMILES:
CNCCC(Oc1ccc(cc1)C(F)(F)F)c1ccccc1
: