Target
Glutamine synthetase
Ligand
BDBM50174522
Substrate
Meas. Tech.
ChEMBL_321474 (CHEMBL880415)
pH
7.4±n/a
IC50
55000±n/a nM
Comments
extracted
Citation
 Berlicki, LObojska, AForlani, GKafarski, P Design, synthesis, and activity of analogues of phosphinothricin as inhibitors of glutamine synthetase. J Med Chem 48:6340-9 (2005)  
Target
Name:
Glutamine synthetase
Synonyms:
GLN1B_ECOLI | glnA
Type:
PROTEIN
Mol. Mass.:
51891.08
Organism:
Escherichia coli (strain K12)
Description:
ChEMBL_321474
Residue:
469
  
Inhibitor
Name:
BDBM50174522
Synonyms:
(S)-2-Amino-4-[(2-amino-ethyl)-hydroxy-phosphinoyl]-butyric acid; dihydrochloride | CHEMBL538331
Type:
Small organic molecule
Emp. Form.:
C6H15N2O4P
Mol. Mass.:
210.1681
SMILES:
N[C@@H](CCP(O)(O)CC=N)C(O)=O
: