Target
Guanine nucleotide-binding protein G(o) subunit alpha
Ligand
BDBM50174644
Substrate
Meas. Tech.
ChEMBL_321106 (CHEMBL882872)
EC50
21400±n/a nM
Citation
 Manetti, DDi Cesare Mannelli, LDei, SGaleotti, NGhelardini, CRomanelli, MNScapecchi, STeodori, EPacini, ABartolini, AGualtieri, F Design, synthesis, and preliminary pharmacological evaluation of a set of small molecules that directly activate gi proteins. J Med Chem 48:6491-503 (2005)  
Target
Name:
Guanine nucleotide-binding protein G(o) subunit alpha
Synonyms:
GNAO1 Guanine nucleotide-binding protein G(o), alpha subunit 1 | guanine nucleotide-binding protein G(o) subunit alpha isoform a
Type:
PROTEIN
Mol. Mass.:
40043.59
Organism:
Homo sapiens (Human)
Description:
ChEMBL_321106
Residue:
354
  
Inhibitor
Name:
BDBM50174644
Synonyms:
1-(1'-Methyl-[4,4']bipiperidinyl-1-yl)-heptadecan-1-one; hydrochloride | CHEMBL535605
Type:
Small organic molecule
Emp. Form.:
C28H54N2O
Mol. Mass.:
434.7412
SMILES:
CCCCCCCCCCCCCCCCC(=O)N1CCC(CC1)C1CCN(C)CC1
: