Target
Guanine nucleotide-binding protein G(i) subunit alpha-1
Ligand
BDBM50174666
Substrate
Meas. Tech.
ChEMBL_321104 (CHEMBL882870)
EC50
32400±n/a nM
Citation
 Manetti, DDi Cesare Mannelli, LDei, SGaleotti, NGhelardini, CRomanelli, MNScapecchi, STeodori, EPacini, ABartolini, AGualtieri, F Design, synthesis, and preliminary pharmacological evaluation of a set of small molecules that directly activate gi proteins. J Med Chem 48:6491-503 (2005)  
Target
Name:
Guanine nucleotide-binding protein G(i) subunit alpha-1
Synonyms:
GNAI1 Guanine nucleotide-binding protein G(i), alpha-1 subunit
Type:
PROTEIN
Mol. Mass.:
40357.62
Organism:
Homo sapiens (Human)
Description:
ChEMBL_321104
Residue:
354
  
Inhibitor
Name:
BDBM50174666
Synonyms:
(1-Pentadecyl-piperidin-4-yl)-piperidin-4-yl-amine; trihydrochloride | CHEMBL536279
Type:
Small organic molecule
Emp. Form.:
C25H51N3
Mol. Mass.:
393.6925
SMILES:
CCCCCCCCCCCCCCCN1CCC(CC1)NC1CCNCC1
: