Target
Guanine nucleotide-binding protein G(i) subunit alpha-1
Ligand
BDBM50174653
Substrate
Meas. Tech.
ChEMBL_321104 (CHEMBL882870)
EC50
17600±n/a nM
Citation
 Manetti, DDi Cesare Mannelli, LDei, SGaleotti, NGhelardini, CRomanelli, MNScapecchi, STeodori, EPacini, ABartolini, AGualtieri, F Design, synthesis, and preliminary pharmacological evaluation of a set of small molecules that directly activate gi proteins. J Med Chem 48:6491-503 (2005)  
Target
Name:
Guanine nucleotide-binding protein G(i) subunit alpha-1
Synonyms:
GNAI1 Guanine nucleotide-binding protein G(i), alpha-1 subunit
Type:
PROTEIN
Mol. Mass.:
40357.62
Organism:
Homo sapiens (Human)
Description:
ChEMBL_321104
Residue:
354
  
Inhibitor
Name:
BDBM50174653
Synonyms:
1-[4,4']Bipiperidinyl-1-yl-tridecan-1-one; hydrochloride | CHEMBL558775
Type:
Small organic molecule
Emp. Form.:
C23H44N2O
Mol. Mass.:
364.6083
SMILES:
CCCCCCCCCCCCC(=O)N1CCC(CC1)C1CCNCC1
: