Target
Guanine nucleotide-binding protein G(i) subunit alpha-3
Ligand
BDBM50174657
Substrate
Meas. Tech.
ChEMBL_321105 (CHEMBL882871)
EC50
25100±n/a nM
Citation
 Manetti, DDi Cesare Mannelli, LDei, SGaleotti, NGhelardini, CRomanelli, MNScapecchi, STeodori, EPacini, ABartolini, AGualtieri, F Design, synthesis, and preliminary pharmacological evaluation of a set of small molecules that directly activate gi proteins. J Med Chem 48:6491-503 (2005)  
Target
Name:
Guanine nucleotide-binding protein G(i) subunit alpha-3
Synonyms:
GNAI3 Guanine nucleotide-binding protein G(k), alpha-3 subunit
Type:
PROTEIN
Mol. Mass.:
40527.21
Organism:
Homo sapiens (Human)
Description:
ChEMBL_321105
Residue:
354
  
Inhibitor
Name:
BDBM50174657
Synonyms:
1-(4-Amino-piperidin-1-yl)-pentadecan-1-one; hydrochloride | CHEMBL541384
Type:
Small organic molecule
Emp. Form.:
C20H40N2O
Mol. Mass.:
324.5444
SMILES:
CCCCCCCCCCCCCCC(=O)N1CCC(N)CC1
: