Target
Guanine nucleotide-binding protein G(o) subunit alpha
Ligand
BDBM50174660
Substrate
Meas. Tech.
ChEMBL_321106 (CHEMBL882872)
EC50
16900±n/a nM
Citation
 Manetti, DDi Cesare Mannelli, LDei, SGaleotti, NGhelardini, CRomanelli, MNScapecchi, STeodori, EPacini, ABartolini, AGualtieri, F Design, synthesis, and preliminary pharmacological evaluation of a set of small molecules that directly activate gi proteins. J Med Chem 48:6491-503 (2005)  
Target
Name:
Guanine nucleotide-binding protein G(o) subunit alpha
Synonyms:
GNAO1 Guanine nucleotide-binding protein G(o), alpha subunit 1 | guanine nucleotide-binding protein G(o) subunit alpha isoform a
Type:
PROTEIN
Mol. Mass.:
40043.59
Organism:
Homo sapiens (Human)
Description:
ChEMBL_321106
Residue:
354
  
Inhibitor
Name:
BDBM50174660
Synonyms:
1-(2-Amino-ethyl)-piperidine-4-carboxylic acid pentadecylamide; dihydrochloride | CHEMBL537856
Type:
Small organic molecule
Emp. Form.:
C23H47N3O
Mol. Mass.:
381.6388
SMILES:
CCCCCCCCCCCCCCCNC(=O)C1CCN(CCN)CC1
: