Target
Peroxisome proliferator-activated receptor delta
Ligand
BDBM50109547
Substrate
Meas. Tech.
ChEMBL_320734 (CHEMBL881207)
Kd
3000±n/a nM
Citation
 Morphy, RRankovic, Z Designed multiple ligands. An emerging drug discovery paradigm. J Med Chem 48:6523-43 (2005)  
Target
Name:
Peroxisome proliferator-activated receptor delta
Synonyms:
NR1C2 NUCI Nuclear receptor subfamily 1 group C member 2 PPAR-beta PPARD Peroxisome proliferator-activated receptor Peroxisome proliferator-activated receptor delta
Type:
Enzyme
Mol. Mass.:
49910.45
Organism:
Homo sapiens (Human)
Description:
Q03181
Residue:
441
  
Inhibitor
Name:
BDBM50109547
Synonyms:
(S)-3-(4-(2-CARBAZOL-9-YL-ETHOXY)-PHENYL)-2-ETHOXY-PROPIONIC ACID 3-[4-(2-Carbazol-9-yl-ethoxy)-phenyl]-2-ethoxy-propionic acid | CHEMBL86658
Type:
Small organic molecule
Emp. Form.:
C25H25NO4
Mol. Mass.:
403.4703
SMILES:
CCO[C@@H](Cc1ccc(OCCn2c3ccccc3c3ccccc23)cc1)C(O)=O
: