Target
Type-1 angiotensin II receptor
Ligand
BDBM50175502
Substrate
Meas. Tech.
ChEMBL_321233 (CHEMBL881768)
Ki
>10±n/a nM
Citation
 Morphy, RRankovic, Z Designed multiple ligands. An emerging drug discovery paradigm. J Med Chem 48:6523-43 (2005)  
Target
Name:
Type-1 angiotensin II receptor
Synonyms:
AGTR1 AGTR1B AT1 AT1BR AT2R1B Angiotensin II receptor Type-1 angiotensin II receptor (AT1)
Type:
Protein
Mol. Mass.:
41080.75
Organism:
Homo sapiens (Human)
Description:
P30556
Residue:
359
  
Inhibitor
Name:
BDBM50175502
Synonyms:
CHEMBL383581 | N-[2'-(4,5-Dimethyl-isoxazol-3-ylsulfamoyl)-4-oxazol-2-yl-biphenyl-2-ylmethyl]-3,3,N-trimethyl-butyramide
Type:
Small organic molecule
Emp. Form.:
C28H32N4O5S
Mol. Mass.:
536.642
SMILES:
CN(Cc1cc(ccc1-c1ccccc1S(=O)(=O)Nc1noc(C)c1C)-c1ncco1)C(=O)CC(C)(C)C
: