Target
Neprilysin
Ligand
BDBM50115848
Substrate
Meas. Tech.
ChEMBL_321178 (CHEMBL882907)
Ki
24±n/a nM
Citation
 Morphy, RRankovic, Z Designed multiple ligands. An emerging drug discovery paradigm. J Med Chem 48:6523-43 (2005)  
Target
Name:
Neprilysin
Synonyms:
Atriopeptidase CD_antigen=CD10 EPN MME NEP_HUMAN Neutral endopeptidase | Neutral endopeptidase 24.11
Type:
Enzyme
Mol. Mass.:
85505.38
Organism:
Homo sapiens (Human)
Description:
P08473
Residue:
750
  
Inhibitor
Name:
BDBM50115848
Synonyms:
(S)-3-(1H-Indol-3-yl)-2-[(R)-3-mercapto-2-((S)-5-methoxy-indan-1-yl)-propionylamino]-propionic acid | CHEMBL305388
Type:
Small organic molecule
Emp. Form.:
C24H26N2O4S
Mol. Mass.:
438.539
SMILES:
COc1ccc2[C@@H](CCc2c1)[C@@H](CS)C(=O)N[C@@H](Cc1c[nH]c2ccccc12)C(O)=O
: