Target
Muscarinic acetylcholine receptor M1
Ligand
BDBM50175575
Substrate
Meas. Tech.
ChEMBL_320891 (CHEMBL872390)
Ki
1.80±n/a nM
Citation
 Naito, RYonetoku, YOkamoto, YToyoshima, AIkeda, KTakeuchi, M Synthesis and antimuscarinic properties of quinuclidin-3-yl 1,2,3,4-tetrahydroisoquinoline-2-carboxylate derivatives as novel muscarinic receptor antagonists. J Med Chem 48:6597-606 (2005)  
Target
Name:
Muscarinic acetylcholine receptor M1
Synonyms:
ACM1_RAT Chrm-1 cholinergic receptor, muscarinic 1
Type:
Enzyme Catalytic Domain
Mol. Mass.:
51390.46
Organism:
RAT
Description:
P08482
Residue:
460
  
Inhibitor
Name:
BDBM50175575
Synonyms:
1-Thiophen-2-yl-3,4-dihydro-1H-isoquinoline-2-carboxylic acid (R)-(1-aza-bicyclo[2.2.2]oct-3-yl) ester | CHEMBL371293
Type:
Small organic molecule
Emp. Form.:
C21H24N2O2S
Mol. Mass.:
368.492
SMILES:
O=C(O[C@H]1CN2CCC1CC2)N1CCc2ccccc2C1c1cccs1
: