Target
DNA polymerase III PolC-type
Ligand
BDBM21686
Substrate
Meas. Tech.
ChEMBL_320983 (CHEMBL872130)
Ki
55±n/a nM
Citation
 Zhi, CLong, ZYManikowski, ABrown, NCTarantino, PMHolm, KDix, EJWright, GEFoster, KAButler, MMLaMarr, WASkow, DJMotorina, ILamothe, SStorer, R Synthesis and antibacterial activity of 3-substituted-6-(3-ethyl-4-methylanilino)uracils. J Med Chem 48:7063-74 (2005)  
Target
Name:
DNA polymerase III PolC-type
Synonyms:
DNA polymerase III DNA-directed DNA polymerase PolIII mutI | polC
Type:
Enzyme
Mol. Mass.:
162625.67
Organism:
Bacillus subtilis
Description:
Enzyme was purified from recombinant strains.
Residue:
1437
  
Inhibitor
Name:
BDBM21686
Synonyms:
3-(4-hydroxybutyl)-6-(3-ethyl-4-methylanilino)uracil CHEMBL327687 HBEMAU
Type:
Small organic molecule
Emp. Form.:
C17H23N3O3
Mol. Mass.:
317.3828
SMILES:
CCc1cc(Nc2cc(=O)n(CCCCO)c(=O)[nH]2)ccc1C
: