Target
3-beta-hydroxysteroid-Delta(8),Delta(7)-isomerase
Ligand
BDBM50179258
Substrate
Meas. Tech.
ChEMBL_325589 (CHEMBL860172)
Ki
16.4±n/a nM
Citation
 Berardi, FFerorelli, SAbate, CPedone, MPColabufo, NAContino, MPerrone, R Methyl substitution on the piperidine ring of N-[omega-(6-methoxynaphthalen-1-yl)alkyl] derivatives as a probe for selective binding and activity at the sigma(1) receptor. J Med Chem 48:8237-44 (2005)  
Target
Name:
3-beta-hydroxysteroid-Delta(8),Delta(7)-isomerase
Synonyms:
EBP | EBP_CAVPO
Type:
PROTEIN
Mol. Mass.:
26684.52
Organism:
Cavia porcellus
Description:
ChEMBL_203193
Residue:
229
  
Inhibitor
Name:
BDBM50179258
Synonyms:
1-(3-(6-methoxy-1,2,3,4-tetrahydronaphthalen-1-yl)propyl)-2,2-dimethylpiperidine hydrochloride CHEMBL537399
Type:
Small organic molecule
Emp. Form.:
C21H33NO
Mol. Mass.:
315.4928
SMILES:
COc1ccc2C(CCCN3CCCCC3(C)C)CCCc2c1
: