Target
Sigma non-opioid intracellular receptor 1
Ligand
BDBM50179265
Substrate
Meas. Tech.
ChEMBL_325587 (CHEMBL860170)
Ki
2.25±n/a nM
Citation
 Berardi, FFerorelli, SAbate, CPedone, MPColabufo, NAContino, MPerrone, R Methyl substitution on the piperidine ring of N-[omega-(6-methoxynaphthalen-1-yl)alkyl] derivatives as a probe for selective binding and activity at the sigma(1) receptor. J Med Chem 48:8237-44 (2005)  
Target
Name:
Sigma non-opioid intracellular receptor 1
Synonyms:
OPRS1 SIGMAR1 Sigma non-opioid intracellular receptor 1 Sigma1-receptor Sterol isomerase-like protein
Type:
Protein
Mol. Mass.:
25307.17
Organism:
Cavia porcellus (Guinea pig)
Description:
Q60492
Residue:
223
  
Inhibitor
Name:
BDBM50179265
Synonyms:
1-(4-(6-methoxynaphthalen-1-yl)butyl)-4,4-dimethylpiperidine hydrochloride | CHEMBL540563
Type:
Small organic molecule
Emp. Form.:
C22H31NO
Mol. Mass.:
325.4876
SMILES:
COc1ccc2c(CCCCN3CCC(C)(C)CC3)cccc2c1
: