Target
C-C chemokine receptor type 1
Ligand
BDBM50174720
Substrate
Meas. Tech.
ChEMBL_325889 (CHEMBL863246)
IC50
3000±n/a nM
Citation
 Revesz, LBollbuck, BBuhl, TEder, JEsser, RFeifel, RHeng, RHiestand, PJachez-Demange, BLoetscher, PSparrer, HSchlapbach, AWaelchli, R Novel CCR1 antagonists with oral activity in the mouse collagen induced arthritis. Bioorg Med Chem Lett 15:5160-4 (2005)  
Target
Name:
C-C chemokine receptor type 1
Synonyms:
C-C CKR-1 CCR-1 CD_antigen=CD191 Cmkbr1 Macrophage inflammatory protein 1-alpha receptor | RANTES-R
Type:
PROTEIN
Mol. Mass.:
40904.59
Organism:
Mus musculus
Description:
ChEMBL_1452291
Residue:
355
  
Inhibitor
Name:
BDBM50174720
Synonyms:
(R)-N-(2-(2-(4-(4-fluorobenzyl)-2-methylpiperazin-1-yl)-2-oxoethylamino)-5-chlorophenyl)acetamide | CHEMBL370162
Type:
Small organic molecule
Emp. Form.:
C22H26ClFN4O2
Mol. Mass.:
432.919
SMILES:
C[C@@H]1CN(Cc2ccc(F)cc2)CCN1C(=O)CNc1ccc(Cl)cc1NC(C)=O
: