Target
Oxytocin receptor
Ligand
BDBM50178151
Substrate
Meas. Tech.
ChEMBL_326537 (CHEMBL863355)
Ki
239±n/a nM
Citation
 Quattropani, ADorbais, JCovini, DPittet, PAColovray, VThomas, RJCoxhead, RHalazy, SScheer, AMissotten, MAyala, GBradshaw, CDe Raemy-Schenk, AMNichols, ACirillo, RTos, EGGiachetti, CGolzio, LMarinelli, PChurch, DJBarberis, CChollet, ASchwarz, MK Discovery and development of a new class of potent, selective, orally active oxytocin receptor antagonists. J Med Chem 48:7882-905 (2005)  
Target
Name:
Oxytocin receptor
Synonyms:
OT-R OXYR_HUMAN | Oxytocin
Type:
Enzyme Catalytic Domain
Mol. Mass.:
42793.26
Organism:
Homo sapiens (Human)
Description:
Oxytocin OXTR HEK293::B2R9L7
Residue:
389
  
Inhibitor
Name:
BDBM50178151
Synonyms:
CHEMBL200729 | N-(4-methylphenyl)-N-{2-oxo-2-[2-(2-oxo-1,2-dihydro-3H-indol-3-ylidene)hydrazino]ethyl}-2-naphthalenesulfonamide
Type:
Small organic molecule
Emp. Form.:
C27H22N4O4S
Mol. Mass.:
498.553
SMILES:
Cc1ccc(cc1)N(CC(=O)N=Nc1c(O)[nH]c2ccccc12)S(=O)(=O)c1ccc2ccccc2c1
: